Reaction Details
TargetPhosphatidylinositol 4-phosphate 5-kinase type-1 alpha
LigandBDBM25118
Substrate/Competitorn/a
Meas. Tech.Kinase Inhibitor Selectivity Profiling Assay
Kd 1900±n/a nM
Citation PubChem, PC Kinase Inhibitor Selectivity Profiling Assay PubChem Bioassay(2008)[AID]
 
Phosphatidylinositol 4-phosphate 5-kinase type-1 alpha
Name:Phosphatidylinositol 4-phosphate 5-kinase type-1 alpha
Type:PROTEIN
Mol. Mass.:62644.19
Organism:Homo sapiens (Human)
Description:ChEMBL_774304
Residue:562
BDBM25118
NameBDBM25118
Synonyms:(3Z)-4-amino-5-fluoro-3-[5-(4-methylpiperazino)-1,3-dihydrobenzimidazol-2-ylidene]carbostyril CHEMBL522892 | CHIR-258
TypeSmall organic molecule
Emp. Form.C21H21FN6O
Mol. Mass.392.4294
SMILESCN1CCN(CC1)c1ccc2nc([nH]c2c1)-c1c(N)c2c(F)cccc2[nH]c1=O