Reaction Details
TargetWee1-like protein kinase
LigandBDBM264260
Substrate/Competitorn/a
Meas. Tech.Wee-1 kinase Assay
Temperature298.15±n/a K
IC50<10±n/a nM
Commentsextracted
Citation O Dowd, CRRountree, JSBurkamp, FWilkinson, AJ Substituted pyrido[4,3-d]pyrimidines as Wee-1 inhibitors US Patent US9714244 Publication Date 7/25/2017
 
Wee1-like protein kinase
Name:Wee1-like protein kinase
Type:PROTEIN
Mol. Mass.:71599.12
Organism:Homo sapiens (Human)
Description:ChEMBL_1445054
Residue:646
BDBM264260
NameBDBM264260
Synonyms:6-(2,6-Dichlorophenyl)-8-(3-hydroxyprop-1-yn-1-yl)-2-((3-methyl-4-(piperazin-1-yl)phenyl)amino)pyrido[4,3-d]pyrimidin-5(6H)-one | US9714244, 14
TypeSmall organic molecule
Emp. Form.C27H24Cl2N6O2
Mol. Mass.535.424
SMILESCc1cc(Nc2ncc3c(n2)c(cn(-c2c(Cl)cccc2Cl)c3=O)C#CCO)ccc1N1CCNCC1