Reaction Details
TargetSRSF protein kinase 2
LigandBDBM31094
Substrate/Competitorn/a
Meas. Tech.Kinase Inhibitor Selectivity Profiling Assay
Kd 330±n/a nM
Citation PubChem, PC Kinase Inhibitor Selectivity Profiling Assay PubChem Bioassay(2008)[AID]
 
SRSF protein kinase 2
Name:SRSF protein kinase 2
Type:PROTEIN
Mol. Mass.:77488.98
Organism:Homo sapiens (Human)
Description:ChEMBL_774248
Residue:688
BDBM31094
NameBDBM31094
Synonyms:PKC-412 | cid_24202429
TypeSmall organic molecule
Emp. Form.C35H30N4O4
Mol. Mass.570.6371
SMILES[H][C@@]12C[C@@H]([C@H](OC)[C@@](C)(O1)n1c3ccccc3c3c4CNC(=O)c4c4c5ccccc5n2c4c13)N(C)C(=O)c1ccccc1