Reaction Details
TargetAtypical kinase COQ8B, mitochondrial
LigandBDBM13531
Substrate/Competitorn/a
Meas. Tech.Kinase Inhibitor Selectivity Profiling Assay
Kd 4900±n/a nM
Citation PubChem, PC Kinase Inhibitor Selectivity Profiling Assay PubChem Bioassay(2008)[AID]
 
Atypical kinase COQ8B, mitochondrial
Name:Atypical kinase COQ8B, mitochondrial
Type:PROTEIN
Mol. Mass.:60073.32
Organism:Homo sapiens (Human)
Description:ChEMBL_586944
Residue:544
BDBM13531
NameBDBM13531
Synonyms:4-(4-Fluorophenyl)-2-(4-hydroxyphenyl)-5-(4-pyridyl)-1H-imidazole 4-[4-(4-fluorophenyl)-5-(4-pyridyl)-4-imidazolin-2-ylidene]cyclohexa-2,5-dien-1-one SB-202190 biotinylated SB202190
TypeSmall organic molecule
Emp. Form.C20H14FN3O
Mol. Mass.331.3431
SMILESOc1ccc(cc1)-c1nc(c([nH]1)-c1ccc(F)cc1)-c1ccncc1