Reaction Details
TargetSphingosine 1-phosphate receptor 1
LigandBDBM37040
Substrate/Competitorn/a
Meas. Tech.Dose Response Assays for S1P1 Agonists and Agonism Potentiators - Potentiator Assay 60K MLSMR
EC50 4761±n/a nM
Citation PubChem, PC Dose Response Assays for S1P1 Agonists and Agonism Potentiators - Potentiator Assay 60K MLSMR PubChem Bioassay(2007)[AID]
 
Sphingosine 1-phosphate receptor 1
Name:Sphingosine 1-phosphate receptor 1
Type:Enzyme
Mol. Mass.:42836.02
Organism:Homo sapiens (Human)
Description:P21453
Residue:382
BDBM37040
NameBDBM37040
Synonyms:3-chloranyl-N-(5-chloranylpyridin-2-yl)-4-ethoxy-benzamide 3-chloro-N-(5-chloro-2-pyridyl)-4-ethoxy-benzamide MLS000089749 cid_3237354
TypeSmall organic molecule
Emp. Form.C14H12Cl2N2O2
Mol. Mass.311.163
SMILESCCOc1ccc(cc1Cl)C(=O)Nc1ccc(Cl)cn1