Reaction Details
TargetPantothenate synthetase
LigandBDBM37288
Substrate/Competitorn/a
Meas. Tech.Mycobacterium tuberculosis Pantothenate Synthetase Assay
IC50>100000±n/a nM
CommentsExtracted from aid = 375 and tid = 17
Citation PubChem, PC Mycobacterium tuberculosis Pantothenate Synthetase Assay PubChem Bioassay(2006)[AID]
 
Pantothenate synthetase
Name:Pantothenate synthetase
Type:n/a
Mol. Mass.:32675.10
Organism:Mycobacterium tuberculosis (strain ATCC 25618 / H37Rv)
Description:ChEMBL_102878
Residue:309
BDBM37288
NameBDBM37288
Synonyms:5-(4-chlorophenyl)-N-[1-(4-methylbenzyl)-1H-pyrazol-3-yl]isoxazole-3-carboxamide 5-(4-chlorophenyl)-N-[1-[(4-methylphenyl)methyl]-3-pyrazolyl]-3-isoxazolecarboxamide MLS000087019 cid_3236497
TypeSmall organic molecule
Emp. Form.C21H17ClN4O2
Mol. Mass.392.838
SMILESCc1ccc(Cn2ccc(NC(=O)c3cc(on3)-c3ccc(Cl)cc3)n2)cc1