Reaction Details
TargetPantothenate synthetase
LigandBDBM37289
Substrate/Competitorn/a
Meas. Tech.Mycobacterium tuberculosis Pantothenate Synthetase Assay
IC50>100000±n/a nM
CommentsExtracted from aid = 375 and tid = 17
Citation PubChem, PC Mycobacterium tuberculosis Pantothenate Synthetase Assay PubChem Bioassay(2006)[AID]
 
Pantothenate synthetase
Name:Pantothenate synthetase
Type:n/a
Mol. Mass.:32675.10
Organism:Mycobacterium tuberculosis (strain ATCC 25618 / H37Rv)
Description:ChEMBL_102878
Residue:309
BDBM37289
NameBDBM37289
Synonyms:MLS000087278 N-[1-(4-chlorobenzyl)-5-methyl-pyrazol-3-yl]-5-(2-thienyl)isoxazole-3-carboxamide N-[1-[(4-chlorophenyl)methyl]-5-methyl-pyrazol-3-yl]-5-thiophen-2-yl-1,2-oxazole-3-carboxamide SMR000023501 | cid_3236539
TypeSmall organic molecule
Emp. Form.C19H15ClN4O2S
Mol. Mass.398.866
SMILESCc1cc(NC(=O)c2cc(on2)-c2cccs2)nn1Cc1ccc(Cl)cc1