Reaction Details
TargetPantothenate synthetase
LigandBDBM37304
Substrate/Competitorn/a
Meas. Tech.Mycobacterium tuberculosis Pantothenate Synthetase Assay
IC50>100000±n/a nM
CommentsExtracted from aid = 375 and tid = 17
Citation PubChem, PC Mycobacterium tuberculosis Pantothenate Synthetase Assay PubChem Bioassay(2006)[AID]
 
Pantothenate synthetase
Name:Pantothenate synthetase
Type:n/a
Mol. Mass.:32675.10
Organism:Mycobacterium tuberculosis (strain ATCC 25618 / H37Rv)
Description:ChEMBL_102878
Residue:309
BDBM37304
NameBDBM37304
Synonyms:5-(2-furanyl)-N-[1-[(4-methylphenyl)methyl]-3-pyrazolyl]-3-isoxazolecarboxamide 5-(2-furyl)-N-[1-(4-methylbenzyl)pyrazol-3-yl]isoxazole-3-carboxamide MLS000087228 cid_3243785
TypeSmall organic molecule
Emp. Form.C19H16N4O3
Mol. Mass.348.3553
SMILESCc1ccc(Cn2ccc(NC(=O)c3cc(on3)-c3ccco3)n2)cc1