Reaction Details
TargetPantothenate synthetase
LigandBDBM37287
Substrate/Competitorn/a
Meas. Tech.Mycobacterium tuberculosis Pantothenate Synthetase Assay
IC50>100000±n/a nM
Commentsk3888r67847
Citation PubChem, PC Mycobacterium tuberculosis Pantothenate Synthetase Assay PubChem Bioassay(2006)[AID]
 
Pantothenate synthetase
Name:Pantothenate synthetase
Type:n/a
Mol. Mass.:32675.10
Organism:Mycobacterium tuberculosis (strain ATCC 25618 / H37Rv)
Description:ChEMBL_102878
Residue:309
BDBM37287
NameBDBM37287
Synonyms:MLS000087275 N-[1-(4-methylbenzyl)pyrazol-3-yl]-5-(2-thienyl)isoxazole-3-carboxamide N-[1-[(4-methylphenyl)methyl]pyrazol-3-yl]-5-thiophen-2-yl-1,2-oxazole-3-carboxamide cid_3236204
TypeSmall organic molecule
Emp. Form.C19H16N4O2S
Mol. Mass.364.421
SMILESCc1ccc(Cn2ccc(NC(=O)c3cc(on3)-c3cccs3)n2)cc1