Reaction Details
TargetPantothenate synthetase
LigandBDBM37290
Substrate/Competitorn/a
Meas. Tech.Mycobacterium tuberculosis Pantothenate Synthetase Assay
IC50>100000±n/a nM
Commentsk3888r67850
Citation PubChem, PC Mycobacterium tuberculosis Pantothenate Synthetase Assay PubChem Bioassay(2006)[AID]
 
Pantothenate synthetase
Name:Pantothenate synthetase
Type:n/a
Mol. Mass.:32675.10
Organism:Mycobacterium tuberculosis (strain ATCC 25618 / H37Rv)
Description:ChEMBL_102878
Residue:309
BDBM37290
NameBDBM37290
Synonyms:5-(4-bromophenyl)-N-[1-(4-methylbenzyl)-1H-pyrazol-3-yl]isoxazole-3-carboxamide 5-(4-bromophenyl)-N-[1-[(4-methylphenyl)methyl]-3-pyrazolyl]-3-isoxazolecarboxamide MLS000087037 cid_3237061
TypeSmall organic molecule
Emp. Form.C21H17BrN4O2
Mol. Mass.437.289
SMILESCc1ccc(Cn2ccc(NC(=O)c3cc(on3)-c3ccc(Br)cc3)n2)cc1