Reaction Details
TargetPantothenate synthetase
LigandBDBM37303
Substrate/Competitorn/a
Meas. Tech.Mycobacterium tuberculosis Pantothenate Synthetase Assay
IC50>100000±n/a nM
Commentsk3888r67864
Citation PubChem, PC Mycobacterium tuberculosis Pantothenate Synthetase Assay PubChem Bioassay(2006)[AID]
 
Pantothenate synthetase
Name:Pantothenate synthetase
Type:n/a
Mol. Mass.:32675.10
Organism:Mycobacterium tuberculosis (strain ATCC 25618 / H37Rv)
Description:ChEMBL_102878
Residue:309
BDBM37303
NameBDBM37303
Synonyms:5-tert-butyl-N-[1-(4-methylbenzyl)-1H-pyrazol-3-yl]-4,5,6,7-tetrahydro-1,2-benzisoxazole-3-carboxamide 5-tert-butyl-N-[1-[(4-methylphenyl)methyl]-3-pyrazolyl]-4,5,6,7-tetrahydro-1,2-benzoxazole-3-carboxamide MLS000087420 cid_3243291
TypeSmall organic molecule
Emp. Form.C23H28N4O2
Mol. Mass.392.494
SMILESCc1ccc(Cn2ccc(NC(=O)c3noc4CCC(Cc34)C(C)(C)C)n2)cc1