Reaction Details
TargetPantothenate synthetase
LigandBDBM37308
Substrate/Competitorn/a
Meas. Tech.Mycobacterium tuberculosis Pantothenate Synthetase Assay
IC50>100000±n/a nM
Commentsk3888r67870
Citation PubChem, PC Mycobacterium tuberculosis Pantothenate Synthetase Assay PubChem Bioassay(2006)[AID]
 
Pantothenate synthetase
Name:Pantothenate synthetase
Type:n/a
Mol. Mass.:32675.10
Organism:Mycobacterium tuberculosis (strain ATCC 25618 / H37Rv)
Description:ChEMBL_102878
Residue:309
BDBM37308
NameBDBM37308
Synonyms:MLS000052224 N-[1-(4-methylbenzyl)pyrazol-3-yl]-5-phenyl-isoxazole-3-carboxamide N-[1-[(4-methylphenyl)methyl]pyrazol-3-yl]-5-phenyl-1,2-oxazole-3-carboxamide cid_1253408
TypeSmall organic molecule
Emp. Form.C21H18N4O2
Mol. Mass.358.3932
SMILESCc1ccc(Cn2ccc(NC(=O)c3cc(on3)-c3ccccc3)n2)cc1