Reaction Details
TargetPantothenate synthetase
LigandBDBM37305
Substrate/Competitorn/a
Meas. Tech.Mycobacterium tuberculosis Pantothenate Synthetase Assay
IC50>100000±n/a nM
CommentsExtracted from aid = 375 and tid = 37
Citation PubChem, PC Mycobacterium tuberculosis Pantothenate Synthetase Assay PubChem Bioassay(2006)[AID]
 
Pantothenate synthetase
Name:Pantothenate synthetase
Type:n/a
Mol. Mass.:32675.10
Organism:Mycobacterium tuberculosis (strain ATCC 25618 / H37Rv)
Description:ChEMBL_102878
Residue:309
BDBM37305
NameBDBM37305
Synonyms:MLS000087114 N-[1-(4-chlorobenzyl)-5-methyl-pyrazol-3-yl]-5-(2-methoxyphenyl)isoxazole-3-carboxamide N-[1-[(4-chlorophenyl)methyl]-5-methyl-pyrazol-3-yl]-5-(2-methoxyphenyl)-1,2-oxazole-3-carboxamide SMR000023337 | cid_3244603
TypeSmall organic molecule
Emp. Form.C22H19ClN4O3
Mol. Mass.422.864
SMILESCOc1ccccc1-c1cc(no1)C(=O)Nc1cc(C)n(Cc2ccc(Cl)cc2)n1