Reaction Details
TargetGenome polyprotein
LigandBDBM403595
Substrate/Competitorn/a
Meas. Tech.Ki Determination for Genotypes 1b and 3a NS3 Protease
Ki 0.040±n/a nM
Citation Bjornson, KCanales, ECottell, JJKarki, KKKatana, AAKato, DKobayashi, TLink, JOMartinez, RPhillips, BWPyun, HSangi, MSchrier, AJSiegel, DTaylor, JGTran, CVTrejo Martin, TAVivian, RWYang, ZZablocki, JZipfel, S Inhibitors of hepatitis C virus US Patent US10335409 Publication Date 7/2/2019
 
Genome polyprotein
Name:Genome polyprotein
Type:Protein
Mol. Mass.:327076.78
Organism:Hepatitis C Virus (Virus)
Description:P26662
Residue:3010
BDBM403595
NameBDBM403595
Synonyms:Preparation of (3aR,7S,10S,11S,12R,24aR)-7-tert-butyl-N-[(1R,2R)-1-[(cyclopropylsulfonyl)carbamoyl]-2-(difluoromethyl)cyclopropyl]-11-ethyl-16-methoxy-5,8-dioxo-1,2,3,3a,5,6,7,8,11,12,20,21,22,23,24,24a-hexadecahydro-10H-9,12-methanocyclopenta[18,19][1,10,3,6]dioxadiazacyclononadecino[11,12-b]quinoxaline-10-carboxamide | US10335409, Example 5
TypeSmall organic molecule
Emp. Form.C37H53ClN4O7
Mol. Mass.701.292
SMILESCC[C@@H]1[C@H](CN([C@@H]1C(=O)OC(C)(C)C)C(=O)[C@@H](NC(=O)O[C@@H]1CCC[C@H]1CCCC=C)C(C)(C)C)Oc1nc2cc(OC)ccc2nc1Cl