Reaction Details
TargetGenome polyprotein
LigandBDBM403609
Substrate/Competitorn/a
Meas. Tech.Ki Determination for Genotypes 1b and 3a NS3 Protease
Ki 0.020±n/a nM
Citation Bjornson, KCanales, ECottell, JJKarki, KKKatana, AAKato, DKobayashi, TLink, JOMartinez, RPhillips, BWPyun, HSangi, MSchrier, AJSiegel, DTaylor, JGTran, CVTrejo Martin, TAVivian, RWYang, ZZablocki, JZipfel, S Inhibitors of hepatitis C virus US Patent US10335409 Publication Date 7/2/2019
 
Genome polyprotein
Name:Genome polyprotein
Type:Protein
Mol. Mass.:327076.78
Organism:Hepatitis C Virus (Virus)
Description:P26662
Residue:3010
BDBM403609
NameBDBM403609
Synonyms:(1aR,5S,8S,9S,10R,22aR)-5-tert-butyl-N-[(1R,2R)-1-[(cyclopropylsulfonyl)carbamoyl]-2-(difluoromethyl)cyclopropyl]-14-methoxy-9-methyl-3,6-dioxo-1,1a,3,4,5,6,9,10,18,19,20,21,22,22a-tetradecahydro-8H-7,10-methanocyclopropa[18,19][1,10,3,6]dioxadiazacyclononadecino[11,12-b]quinoxaline-8-carboxamide | US10335409, Example 19
TypeSmall organic molecule
Emp. Form.C38H50F2N6O9S
Mol. Mass.804.9
SMILESCOc1ccc2nc3CCCCC[C@@H]4C[C@H]4OC(=O)N[C@H](C(=O)N4C[C@H](Oc3nc2c1)[C@@H](C)[C@H]4C(=O)N[C@@]1(C[C@H]1C(F)F)C(=O)NS(=O)(=O)C1CC1)C(C)(C)C