Reaction Details
TargetGenome polyprotein
LigandBDBM403623
Substrate/Competitorn/a
Meas. Tech.Ki Determination for Genotypes 1b and 3a NS3 Protease
Ki 0.030±n/a nM
Citation Bjornson, KCanales, ECottell, JJKarki, KKKatana, AAKato, DKobayashi, TLink, JOMartinez, RPhillips, BWPyun, HSangi, MSchrier, AJSiegel, DTaylor, JGTran, CVTrejo Martin, TAVivian, RWYang, ZZablocki, JZipfel, S Inhibitors of hepatitis C virus US Patent US10335409 Publication Date 7/2/2019
 
Genome polyprotein
Name:Genome polyprotein
Type:Protein
Mol. Mass.:327076.78
Organism:Hepatitis C Virus (Virus)
Description:P26662
Residue:3010
BDBM403623
NameBDBM403623
Synonyms:(1aS,2aR,6S,9S,10S,11R,23aR,23bS)-6-tert-butyl-N-[(1 S,2R)-1-[(cyclopropylsulfonyl)carbamoyl]-2-(difluoromethyl)cyclopropyl]-15-methoxy-10-methyl-4,7-dioxo-1a,2,2a,4,5,6,7,10,11,19,20,21,22,23,23a,23b-hexadecahydro-1H,9H-8,11-methanocyclopropa[4′,5′]cyclopenta[1′,2′:18,19][1,10,3,6]dioxadiazacyclononadecino[11,12-b]quinoxaline-9-carboxamide | US10335409, Example 33
TypeSmall organic molecule
Emp. Form.C39H54N4O7
Mol. Mass.690.8687
SMILESCOc1ccc2nc(C=C)c(O[C@H]3CN([C@@H]([C@@H]3C)C(=O)OC(C)(C)C)C(=O)[C@@H](NC(=O)O[C@H]3C[C@H]4C[C@H]4[C@@H]3CCCC=C)C(C)(C)C)nc2c1