Reaction Details
TargetGenome polyprotein
LigandBDBM403636
Substrate/Competitorn/a
Meas. Tech.Ki Determination for Genotypes 1b and 3a NS3 Protease
Ki 0.050±n/a nM
Citation Bjornson, KCanales, ECottell, JJKarki, KKKatana, AAKato, DKobayashi, TLink, JOMartinez, RPhillips, BWPyun, HSangi, MSchrier, AJSiegel, DTaylor, JGTran, CVTrejo Martin, TAVivian, RWYang, ZZablocki, JZipfel, S Inhibitors of hepatitis C virus US Patent US10335409 Publication Date 7/2/2019
 
Genome polyprotein
Name:Genome polyprotein
Type:Enzyme Catalytic Domain
Mol. Mass.:328455.91
Organism:Hepatitis C virus genotype 3a (isolate k3a) (HCV)
Description:Q81495
Residue:3021
BDBM403636
NameBDBM403636
Synonyms:(1aR,5S,8S,9S,10R,22aR)-5-tert-butyl-N-[(1R,2R)-2-(difluoromethyl)-1-{[(1-methylcyclopropyl)sulfonyl]carbamoyl}cyclopropyl]-18,18-difluoro-14-methoxy-9-methyl-3,6-dioxo-1,1a,3,4,5,6,9,10,18,19,20,21,22,22a-tetradecahydro-8H-7,10-methanocyclopropa[18,19][1,10,3,6]dioxadiazacyclononadecino[11,12-b]quinoxaline-8-carboxamide US10335409, Example 47
TypeSmall organic molecule
Emp. Form.C36H48F2N4O7
Mol. Mass.686.7857
SMILESCOc1ccc2nc(c(O[C@H]3CN([C@@H]([C@@H]3C)C(=O)OC(C)(C)C)C(=O)[C@@H](NC(=O)O[C@@H]3C[C@H]3CCC=C)C(C)(C)C)nc2c1)C(F)(F)C=C