Reaction Details
TargetGenome polyprotein
LigandBDBM403653
Substrate/Competitorn/a
Meas. Tech.Ki Determination for Genotypes 1b and 3a NS3 Protease
Ki 0.030±n/a nM
Citation Bjornson, KCanales, ECottell, JJKarki, KKKatana, AAKato, DKobayashi, TLink, JOMartinez, RPhillips, BWPyun, HSangi, MSchrier, AJSiegel, DTaylor, JGTran, CVTrejo Martin, TAVivian, RWYang, ZZablocki, JZipfel, S Inhibitors of hepatitis C virus US Patent US10335409 Publication Date 7/2/2019
 
Genome polyprotein
Name:Genome polyprotein
Type:Protein
Mol. Mass.:327076.78
Organism:Hepatitis C Virus (Virus)
Description:P26662
Residue:3010
BDBM403653
NameBDBM403653
Synonyms:(1aR,5S,8S,9S,10R,22aR)-5-tert-butyl-N-[(1R,2R)-2-(difluoromethyl)-1-{[(1-methylcyclopropyl)sulfonyl]carbamoyl}cyclopropyl]-9-ethyl-18,18-difluoro-14-methoxy-1a-methyl-3,6-dioxo-1,1a,3,4,5,6,9,10,18,19,20,21,22,22a-tetradecahydro-8H-7,10-methanocyclopropa[18,19][1,10,3,6]dioxadiazacyclononadecino[11,12-b]quinoxaline-8-carboxamide | US10335409, Example 63
TypeSmall organic molecule
Emp. Form.C38H52F2N4O7
Mol. Mass.714.8389
SMILESCC[C@@H]1[C@H](CN([C@@H]1C(=O)OC(C)(C)C)C(=O)[C@@H](NC(=O)OC1(C)CC1CCC=C)C(C)(C)C)Oc1nc2cc(OC)ccc2nc1C(F)(F)C=C