Reaction Details
TargetGenome polyprotein
LigandBDBM403656
Substrate/Competitorn/a
Meas. Tech.Ki Determination for Genotypes 1b and 3a NS3 Protease
Ki 0.040±n/a nM
Citation Bjornson, KCanales, ECottell, JJKarki, KKKatana, AAKato, DKobayashi, TLink, JOMartinez, RPhillips, BWPyun, HSangi, MSchrier, AJSiegel, DTaylor, JGTran, CVTrejo Martin, TAVivian, RWYang, ZZablocki, JZipfel, S Inhibitors of hepatitis C virus US Patent US10335409 Publication Date 7/2/2019
 
Genome polyprotein
Name:Genome polyprotein
Type:Protein
Mol. Mass.:327076.78
Organism:Hepatitis C Virus (Virus)
Description:P26662
Residue:3010
BDBM403656
NameBDBM403656
Synonyms:(4aR,8S,11 S,12S,13R,25aR)-8-tert-butyl-N-[(1R,2R)-1-[(cyclopropylsulfonyl)carbamoyl]-2-(difluoromethyl)cyclopropyl]-12-ethyl-17-methoxy-6,9-dioxo-2,3,4,4a,6,7,8,9,12,13,21,22,23,24,25,25a-hexadecahydro-1H,11H-10,13-methanoquinoxalino[2,3-k][1,10,3,6]benzodioxadiazacyclononadecine-11-carboxamide | US10335409, Example 66
TypeSmall organic molecule
Emp. Form.C42H56F2N6O9S
Mol. Mass.858.991
SMILESCC[C@@H]1[C@@H]2CN([C@@H]1C(=O)N[C@@]1(C[C@H]1C(F)F)C(=O)NS(=O)(=O)C1CC1)C(=O)[C@@H](NC(=O)O[C@@H]1CCC=C[C@H]1CCCCCc1nc3ccc(OC)cc3nc1O2)C(C)(C)C