Reaction Details
TargetGenome polyprotein
LigandBDBM403658
Substrate/Competitorn/a
Meas. Tech.Ki Determination for Genotypes 1b and 3a NS3 Protease
Ki 0.050±n/a nM
Citation Bjornson, KCanales, ECottell, JJKarki, KKKatana, AAKato, DKobayashi, TLink, JOMartinez, RPhillips, BWPyun, HSangi, MSchrier, AJSiegel, DTaylor, JGTran, CVTrejo Martin, TAVivian, RWYang, ZZablocki, JZipfel, S Inhibitors of hepatitis C virus US Patent US10335409 Publication Date 7/2/2019
 
Genome polyprotein
Name:Genome polyprotein
Type:Protein
Mol. Mass.:327076.78
Organism:Hepatitis C Virus (Virus)
Description:P26662
Residue:3010
BDBM403658
NameBDBM403658
Synonyms:(4aR,8S,11 S,12S,13R,25aS)-8-tert-butyl-N-[(1R,2R)-1-[(cyclopropylsulfonyl)carbamoyl]-2-(difluoromethyl)cyclopropyl]-21,21-difluoro-17-methoxy-12-methyl-6,9-dioxo-2,3,4,4a,6,7,8,9,12,13,21,22,23,24,25,25a-hexadecahydro-1H,11H-10,13-methanoquinoxalino[2,3-k][1,10,3,6]benzodioxadiazacyclononadecine-11-carboxamide | US10335409, Example 68
TypeSmall organic molecule
Emp. Form.C41H52F4N6O9S
Mol. Mass.880.945
SMILESCOc1ccc2nc3c(O[C@H]4CN([C@@H]([C@@H]4C)C(=O)N[C@@]4(C[C@H]4C(F)F)C(=O)NS(=O)(=O)C4CC4)C(=O)[C@@H](NC(=O)O[C@@H]4CCC=C[C@H]4CCCCC3(F)F)C(C)(C)C)nc2c1