Reaction Details
TargetGenome polyprotein
LigandBDBM403678
Substrate/Competitorn/a
Meas. Tech.Ki Determination for Genotypes 1b and 3a NS3 Protease
Ki 0.050±n/a nM
Citation Bjornson, KCanales, ECottell, JJKarki, KKKatana, AAKato, DKobayashi, TLink, JOMartinez, RPhillips, BWPyun, HSangi, MSchrier, AJSiegel, DTaylor, JGTran, CVTrejo Martin, TAVivian, RWYang, ZZablocki, JZipfel, S Inhibitors of hepatitis C virus US Patent US10335409 Publication Date 7/2/2019
 
Genome polyprotein
Name:Genome polyprotein
Type:Enzyme Catalytic Domain
Mol. Mass.:328455.91
Organism:Hepatitis C virus genotype 3a (isolate k3a) (HCV)
Description:Q81495
Residue:3021
BDBM403678
NameBDBM403678
Synonyms:(1aR,5S,8S,9S,10R,19E,22aR)-5-tert-butyl-N-[(1R,2R)-2-(difluoromethyl-1-{[(1-methylcyclopropyl)sulfonyl]carbamoyl}cyclopropyl]-9-ethyl-18,18-difluoro-14-methoxy-3,6-dioxo-1,1a,3,4,5,6,9,10,18,21,22,22a-dodecahydro-8H-7,10-methanocyclopropa[18,19][1,10,3,6]dioxadiazacyclononadecino[11,12-b]quinoxaline-8-carboxamide | US10335409, Example 89
TypeSmall organic molecule
Emp. Form.C40H50F4N6O9S
Mol. Mass.866.918
SMILESCC[C@@H]1[C@@H]2CN([C@@H]1C(=O)N[C@@]1(C[C@H]1C(F)F)C(=O)NS(=O)(=O)C1(C)CC1)C(=O)[C@@H](NC(=O)O[C@@H]1C[C@H]1CC\C=C\C(F)(F)c1nc3ccc(OC)cc3nc1O2)C(C)(C)C