Reaction Details
TargetSphingosine 1-phosphate receptor 1
LigandBDBM36818
Substrate/Competitorn/a
Meas. Tech.Dose Response Assays for S1P1 Agonists and Agonism Potentiators - Agonist Assay 60K MLSMR
EC50 3049±n/a nM
Citation PubChem, PC Dose Response Assays for S1P1 Agonists and Agonism Potentiators - Agonist Assay 60K MLSMR PubChem Bioassay(2007)[AID]
 
Sphingosine 1-phosphate receptor 1
Name:Sphingosine 1-phosphate receptor 1
Type:Enzyme
Mol. Mass.:42836.02
Organism:Homo sapiens (Human)
Description:P21453
Residue:382
BDBM36818
NameBDBM36818
Synonyms:MLS000068975 N-[4-(5-methyl-1,3-benzoxazol-2-yl)phenyl]-3-pyridinecarboxamide N-[4-(5-methyl-1,3-benzoxazol-2-yl)phenyl]pyridine-3-carboxamide cid_645017
TypeSmall organic molecule
Emp. Form.C20H15N3O2
Mol. Mass.329.352
SMILESCc1ccc2oc(nc2c1)-c1ccc(NC(=O)c2cccnc2)cc1