Reaction Details
TargetSphingosine 1-phosphate receptor 1
LigandBDBM36840
Substrate/Competitorn/a
Meas. Tech.Dose Response Assays for S1P1 Agonists and Agonism Potentiators - Agonist Assay 60K MLSMR
EC50 1181±n/a nM
Citation PubChem, PC Dose Response Assays for S1P1 Agonists and Agonism Potentiators - Agonist Assay 60K MLSMR PubChem Bioassay(2007)[AID]
 
Sphingosine 1-phosphate receptor 1
Name:Sphingosine 1-phosphate receptor 1
Type:Enzyme
Mol. Mass.:42836.02
Organism:Homo sapiens (Human)
Description:P21453
Residue:382
BDBM36840
NameBDBM36840
Synonyms:2-(3,4-Diethoxy-phenyl)-5-furan-2-yl-[1,3,4]oxadiazole 2-(3,4-diethoxyphenyl)-5-(2-furyl)-1,3,4-oxadiazole MLS000031524 cid_648294
TypeSmall organic molecule
Emp. Form.C16H16N2O4
Mol. Mass.300.3092
SMILESCCOc1ccc(cc1OCC)-c1nnc(o1)-c1ccco1