Reaction Details
TargetSphingosine 1-phosphate receptor 1
LigandBDBM37170
Substrate/Competitorn/a
Meas. Tech.Dose Response Assays for S1P1 Agonists and Agonism Potentiators - Agonist Assay 60K MLSMR
EC50 10730±n/a nM
Citation PubChem, PC Dose Response Assays for S1P1 Agonists and Agonism Potentiators - Agonist Assay 60K MLSMR PubChem Bioassay(2007)[AID]
 
Sphingosine 1-phosphate receptor 1
Name:Sphingosine 1-phosphate receptor 1
Type:Enzyme
Mol. Mass.:42836.02
Organism:Homo sapiens (Human)
Description:P21453
Residue:382
BDBM37170
NameBDBM37170
Synonyms:3-methyl-4-oxo-6-(3,4,5-trimethoxyphenyl)-1,5,6,7-tetrahydroindole-2-carboxylic acid prop-2-enyl ester MLS000116495 cid_5308217 prop-2-enyl 3-methyl-4-oxo-6-(3,4,5-trimethoxyphenyl)-1,5,6,7-tetrahydroindole-2-carboxylate
TypeSmall organic molecule
Emp. Form.C22H25NO6
Mol. Mass.399.437
SMILESCOc1cc(cc(OC)c1OC)C1Cc2[nH]c(C(=O)OCC=C)c(C)c2C(=O)C1