Reaction Details
TargetSphingosine 1-phosphate receptor 1
LigandBDBM31083
Substrate/Competitorn/a
Meas. Tech.Dose Response Assays for S1P1 Agonists and Agonism Potentiators - Agonist Assay 60K MLSMR
EC50 11790±n/a nM
Citation PubChem, PC Dose Response Assays for S1P1 Agonists and Agonism Potentiators - Agonist Assay 60K MLSMR PubChem Bioassay(2007)[AID]
 
Sphingosine 1-phosphate receptor 1
Name:Sphingosine 1-phosphate receptor 1
Type:Enzyme
Mol. Mass.:42836.02
Organism:Homo sapiens (Human)
Description:P21453
Residue:382
BDBM31083
NameBDBM31083
Synonyms:MLS000107813 [4-(4,7-dimethyl-1,3-dioxo-3a,7a-dihydro-octahydro-1H-4,7-epoxyisoindol-2-yl)phenyl] acetate acetic acid [4-(1,3-diketo-4,7-dimethyl-3a,7a-dihydro-octahydro-1H-4,7-epoxyisoindol-2-yl)phenyl] ester cid_2860584
TypeSmall organic molecule
Emp. Form.C18H17NO5
Mol. Mass.327.3313
SMILESCC(=O)Oc1ccc(cc1)-n1c(O)c2c(c1O)C1(C)OC2(C)C=C1