Reaction Details
TargetHuntingtin
LigandBDBM32023
Substrate/Competitorn/a
Meas. Tech.Clearance of Mutant Huntingtin Protein - Confirmatory screen
IC50 80±n/a nM
Citation PubChem, PC Clearance of Mutant Huntingtin Protein - Confirmatory screen PubChem Bioassay(2007)[AID]
 
Huntingtin
Name:Huntingtin
Type:PROTEIN
Mol. Mass.:347579.69
Organism:Homo sapiens (Human)
Description:EBI_101216
Residue:3142
BDBM32023
NameBDBM32023
Synonyms:(2E,4S,4aS,5aS,6S,12aS)-2-[amino(hydroxy)methylene]-4-(dimethylamino)-6,10,11,12a-tetrahydroxy-6-methyl-4,4a,5,5a-tetrahydrotetracene-1,3,12-trione (2E,4S,4aS,5aS,6S,12aS)-2-[azanyl(oxidanyl)methylidene]-4-(dimethylamino)-6-methyl-6,10,11,12a-tetrakis(oxidanyl)-4,4a,5,5a-tetrahydrotetracene-1,3,12-trione SMR000058220 cid_5388997
TypeSmall organic molecule
Emp. Form.C22H24N2O8
Mol. Mass.444.4346
SMILESCN(C)[C@H]1[C@@H]2C[C@H]3C(C(=O)c4c(O)cccc4[C@@]3(C)O)C(=O)[C@]2(O)C(=O)C(C(N)=O)C1=O