Reaction Details
TargetfMet-Leu-Phe receptor
LigandBDBM37613
Substrate/Competitorn/a
Meas. Tech.Dose Response Assay for Formylpeptide Receptor (FPR) Ligands and Dose Response Counter-Screen Assay for Formylpeptide-Like-1 (FPRL1) Ligands
Ki 3600±n/a nM
Citation PubChem, PC Dose Response Assay for Formylpeptide Receptor (FPR) Ligands and Dose Response Counter-Screen Assay for Formylpeptide-Like-1 (FPRL1) Ligands PubChem Bioassay(2007)[AID]
 
fMet-Leu-Phe receptor
Name:fMet-Leu-Phe receptor
Type:Enzyme Catalytic Domain
Mol. Mass.:38456.14
Organism:Homo sapiens (Human)
Description:gi_4503779
Residue:350
BDBM37613
NameBDBM37613
Synonyms:(4Z)-4-[hydroxy(phenyl)methylene]-1-isobutyl-5-(2-methoxyphenyl)pyrrolidine-2,3-quinone (4Z)-5-(2-methoxyphenyl)-1-(2-methylpropyl)-4-[oxidanyl(phenyl)methylidene]pyrrolidine-2,3-dione MLS000029388 cid_5766180
TypeSmall organic molecule
Emp. Form.C22H23NO4
Mol. Mass.365.4223
SMILESCOc1ccccc1C1C(C(=O)c2ccccc2)C(=O)C(=O)N1CC(C)C