Reaction Details
TargetfMet-Leu-Phe receptor
LigandBDBM37643
Substrate/Competitorn/a
Meas. Tech.Dose Response Assay for Formylpeptide Receptor (FPR) Ligands and Dose Response Counter-Screen Assay for Formylpeptide-Like-1 (FPRL1) Ligands
Ki 2200±n/a nM
Citation PubChem, PC Dose Response Assay for Formylpeptide Receptor (FPR) Ligands and Dose Response Counter-Screen Assay for Formylpeptide-Like-1 (FPRL1) Ligands PubChem Bioassay(2007)[AID]
 
fMet-Leu-Phe receptor
Name:fMet-Leu-Phe receptor
Type:Enzyme Catalytic Domain
Mol. Mass.:38456.14
Organism:Homo sapiens (Human)
Description:gi_4503779
Residue:350
BDBM37643
NameBDBM37643
Synonyms:(4Z)-5-(2,5-dimethoxyphenyl)-1-(2-furanylmethyl)-4-[hydroxy(phenyl)methylidene]pyrrolidine-2,3-dione (4Z)-5-(2,5-dimethoxyphenyl)-1-(furan-2-ylmethyl)-4-[hydroxy(phenyl)methylidene]pyrrolidine-2,3-dione MLS000036525 cid_5389251
TypeSmall organic molecule
Emp. Form.C24H21NO6
Mol. Mass.419.4266
SMILESCOc1ccc(OC)c(c1)C1C(C(=O)c2ccccc2)C(=O)C(=O)N1Cc1ccco1