Reaction Details
TargetfMet-Leu-Phe receptor
LigandBDBM37762
Substrate/Competitorn/a
Meas. Tech.Dose Response Assay for Formylpeptide Receptor (FPR) Ligands and Dose Response Counter-Screen Assay for Formylpeptide-Like-1 (FPRL1) Ligands
Ki 6400±n/a nM
Citation PubChem, PC Dose Response Assay for Formylpeptide Receptor (FPR) Ligands and Dose Response Counter-Screen Assay for Formylpeptide-Like-1 (FPRL1) Ligands PubChem Bioassay(2007)[AID]
 
fMet-Leu-Phe receptor
Name:fMet-Leu-Phe receptor
Type:Enzyme Catalytic Domain
Mol. Mass.:38456.14
Organism:Homo sapiens (Human)
Description:gi_4503779
Residue:350
BDBM37762
NameBDBM37762
Synonyms:3-(furan-2-carbonyl)-4-hydroxy-2-(4-prop-2-enoxyphenyl)-1-(pyridin-3-ylmethyl)-2H-pyrrol-5-one 3-[2-furanyl(oxo)methyl]-4-hydroxy-2-(4-prop-2-enoxyphenyl)-1-(3-pyridinylmethyl)-2H-pyrrol-5-one 5-[4-(allyloxy)phenyl]-4-(2-furoyl)-3-hydroxy-1-(3-pyridinylmethyl)-1,5-dihydro-2H-pyrrol-2-one SMR000071262 | cid_2911378
TypeSmall organic molecule
Emp. Form.C24H20N2O5
Mol. Mass.416.426
SMILESC=CCOc1ccc(cc1)C1C(C(=O)c2ccco2)C(=O)C(=O)N1Cc1cccnc1