Reaction Details
TargetfMet-Leu-Phe receptor
LigandBDBM37746
Substrate/Competitorn/a
Meas. Tech.Dose Response Assay for Formylpeptide Receptor (FPR) Ligands and Dose Response Counter-Screen Assay for Formylpeptide-Like-1 (FPRL1) Ligands
IC50>66700±n/a nM
Citation PubChem, PC Dose Response Assay for Formylpeptide Receptor (FPR) Ligands and Dose Response Counter-Screen Assay for Formylpeptide-Like-1 (FPRL1) Ligands PubChem Bioassay(2007)[AID]
 
fMet-Leu-Phe receptor
Name:fMet-Leu-Phe receptor
Type:Enzyme Catalytic Domain
Mol. Mass.:38456.14
Organism:Homo sapiens (Human)
Description:gi_4503779
Residue:350
BDBM37746
NameBDBM37746
Synonyms:MLS000045943 N-(5-imidazo[1,2-a]pyrimidin-2-yl-2-methoxy-phenyl)-3-methyl-butyramide N-[5-(2-imidazo[1,2-a]pyrimidinyl)-2-methoxyphenyl]-3-methylbutanamide cid_3244709
TypeSmall organic molecule
Emp. Form.C18H20N4O2
Mol. Mass.324.377
SMILESCOc1ccc(cc1NC(=O)CC(C)C)-c1cn2cccnc2n1