Reaction Details
TargetN-formyl peptide receptor 2
LigandBDBM35408
Substrate/Competitorn/a
Meas. Tech.Dose Response Assay for Formylpeptide Receptor-Like-1 (FPRL1) Ligands and Dose Response Counter-Screen Assay for Formylpeptide Receptor (FPR) Ligands
Ki>40300±n/a nM
CommentsExtracted from aid = 520 and tid = 2
Citation PubChem, PC Dose Response Assay for Formylpeptide Receptor-Like-1 (FPRL1) Ligands and Dose Response Counter-Screen Assay for Formylpeptide Receptor (FPR) Ligands PubChem Bioassay(2007)[AID]
 
N-formyl peptide receptor 2
Name:N-formyl peptide receptor 2
Type:G Protein-Coupled Receptor (GPCR)
Mol. Mass.:38968.35
Organism:Homo sapiens (Human)
Description:P25090
Residue:351
BDBM35408
NameBDBM35408
Synonyms:1-ethyl-4-keto-N-(4-methylcyclohexyl)-6-piperidinosulfonyl-quinoline-3-carboxamide 1-ethyl-N-(4-methylcyclohexyl)-4-oxo-6-(1-piperidinylsulfonyl)-3-quinolinecarboxamide 1-ethyl-N-(4-methylcyclohexyl)-4-oxo-6-piperidin-1-ylsulfonylquinoline-3-carboxamide SMR000030673 | cid_3243811
TypeSmall organic molecule
Emp. Form.C24H33N3O4S
Mol. Mass.459.602
SMILESCCn1cc(C(=O)NC2CCC(C)CC2)c(=O)c2cc(ccc12)S(=O)(=O)N1CCCCC1