Reaction Details
TargetN-formyl peptide receptor 2
LigandBDBM23421
Substrate/Competitorn/a
Meas. Tech.Dose Response Assay for Formylpeptide Receptor-Like-1 (FPRL1) Ligands and Dose Response Counter-Screen Assay for Formylpeptide Receptor (FPR) Ligands
Ki>40300±n/a nM
CommentsExtracted from aid = 520 and tid = 2
Citation PubChem, PC Dose Response Assay for Formylpeptide Receptor-Like-1 (FPRL1) Ligands and Dose Response Counter-Screen Assay for Formylpeptide Receptor (FPR) Ligands PubChem Bioassay(2007)[AID]
 
N-formyl peptide receptor 2
Name:N-formyl peptide receptor 2
Type:G Protein-Coupled Receptor (GPCR)
Mol. Mass.:38968.35
Organism:Homo sapiens (Human)
Description:P25090
Residue:351
BDBM23421
NameBDBM23421
Synonyms:1-benzyl-3-hydroxy-4-[(5-methylfuran-2-yl)carbonyl]-5-(pyridin-3-yl)-2,5-dihydro-1H-pyrrol-2-one | ChemBridge CNS-Set 7504601, 1
TypeSmall organic molecule
Emp. Form.C22H18N2O4
Mol. Mass.374.3893
SMILESCc1ccc(o1)C(=O)C1C(N(Cc2ccccc2)C(=O)C1=O)c1cccnc1