Reaction Details
TargetN-formyl peptide receptor 2
LigandBDBM37719
Substrate/Competitorn/a
Meas. Tech.Dose Response Assay for Formylpeptide Receptor-Like-1 (FPRL1) Ligands and Dose Response Counter-Screen Assay for Formylpeptide Receptor (FPR) Ligands
IC50 18500±n/a nM
CommentsExtracted from aid = 520 and tid = 3
Citation PubChem, PC Dose Response Assay for Formylpeptide Receptor-Like-1 (FPRL1) Ligands and Dose Response Counter-Screen Assay for Formylpeptide Receptor (FPR) Ligands PubChem Bioassay(2007)[AID]
 
N-formyl peptide receptor 2
Name:N-formyl peptide receptor 2
Type:G Protein-Coupled Receptor (GPCR)
Mol. Mass.:38968.35
Organism:Homo sapiens (Human)
Description:P25090
Residue:351
BDBM37719
NameBDBM37719
Synonyms:2-[[4-methyl-5-[[(3,4,5-triethoxybenzoyl)amino]methyl]-1,2,4-triazol-3-yl]thio]acetic acid methyl ester MLS000087567 cid_3240462 methyl 2-[[4-methyl-5-[[(3,4,5-triethoxyphenyl)carbonylamino]methyl]-1,2,4-triazol-3-yl]sulfanyl]ethanoate | methyl [(4-methyl-5-{[(3,4,5-triethoxybenzoyl)amino]methyl}-4H-1,2,4-triazol-3-yl)thio]acetate
TypeSmall organic molecule
Emp. Form.C20H28N4O6S
Mol. Mass.452.525
SMILESCCOc1cc(cc(OCC)c1OCC)C(=O)NCc1nnc(SCC(=O)OC)n1C