Reaction Details
TargetN-formyl peptide receptor 2
LigandBDBM37752
Substrate/Competitorn/a
Meas. Tech.Dose Response Assay for Formylpeptide Receptor-Like-1 (FPRL1) Ligands and Dose Response Counter-Screen Assay for Formylpeptide Receptor (FPR) Ligands
IC50 49900±n/a nM
CommentsExtracted from aid = 520 and tid = 3
Citation PubChem, PC Dose Response Assay for Formylpeptide Receptor-Like-1 (FPRL1) Ligands and Dose Response Counter-Screen Assay for Formylpeptide Receptor (FPR) Ligands PubChem Bioassay(2007)[AID]
 
N-formyl peptide receptor 2
Name:N-formyl peptide receptor 2
Type:G Protein-Coupled Receptor (GPCR)
Mol. Mass.:38968.35
Organism:Homo sapiens (Human)
Description:P25090
Residue:351
BDBM37752
NameBDBM37752
Synonyms:MLS000086406 SMR000021908 | cid_3245701
TypeSmall organic molecule
Emp. Form.C24H24N4O6
Mol. Mass.464.4706
SMILESCCOC(=O)N1CCN(CC1)c1cc(NCCC(O)=O)c2C(=O)c3ccccc3-c3onc1c23