Reaction Details
TargetN-formyl peptide receptor 2
LigandBDBM34498
Substrate/Competitorn/a
Meas. Tech.Dose Response Assay for Formylpeptide Receptor-Like-1 (FPRL1) Ligands and Dose Response Counter-Screen Assay for Formylpeptide Receptor (FPR) Ligands
IC50>66700±n/a nM
CommentsExtracted from aid = 520 and tid = 3
Citation PubChem, PC Dose Response Assay for Formylpeptide Receptor-Like-1 (FPRL1) Ligands and Dose Response Counter-Screen Assay for Formylpeptide Receptor (FPR) Ligands PubChem Bioassay(2007)[AID]
 
N-formyl peptide receptor 2
Name:N-formyl peptide receptor 2
Type:G Protein-Coupled Receptor (GPCR)
Mol. Mass.:38968.35
Organism:Homo sapiens (Human)
Description:P25090
Residue:351
BDBM34498
NameBDBM34498
Synonyms:2-[(5-cyclopropylisoxazole-3-carbonyl)amino]-4,5,6,7-tetrahydrobenzothiophene-3-carboxylic acid ethyl ester MLS000116347 cid_5307410 ethyl 2-[(5-cyclopropyl-1,2-oxazole-3-carbonyl)amino]-4,5,6,7-tetrahydro-1-benzothiophene-3-carboxylate
TypeSmall organic molecule
Emp. Form.C18H20N2O4S
Mol. Mass.360.427
SMILESCCOC(=O)c1c(NC(=O)c2cc(on2)C2CC2)sc2CCCCc12