Reaction Details
TargetcAMP-dependent protein kinase catalytic subunit alpha
LigandBDBM37913
Substrate/Competitorn/a
Meas. Tech.Dose-response biochemical assay for inhibitors of protein kinase A (PKA) activity
IC50 1761±n/a nM
Citation PubChem, PC Dose-response biochemical assay for inhibitors of protein kinase A (PKA) activity PubChem Bioassay(2007)[AID]
 
cAMP-dependent protein kinase catalytic subunit alpha
Name:cAMP-dependent protein kinase catalytic subunit alpha
Type:Enzyme Catalytic Subunit
Mol. Mass.:40598.73
Organism:Homo sapiens (Human)
Description:n/a
Residue:351
BDBM37913
NameBDBM37913
Synonyms:MLS000065710 N-(5-pyridin-4-yl-1,3,4-thiadiazol-2-yl)-2-thiophen-2-ylacetamide N-[5-(4-pyridyl)-1,3,4-thiadiazol-2-yl]-2-(2-thienyl)acetamide cid_1245524
TypeSmall organic molecule
Emp. Form.C13H10N4OS2
Mol. Mass.302.375
SMILESO=C(Cc1cccs1)Nc1nnc(s1)-c1ccncc1