Reaction Details
TargetDiphosphomevalonate decarboxylase
LigandBDBM34233
Substrate/Competitorn/a
Meas. Tech.Screening for Inhibitors of the Mevalonate Pathway in Streptococcus Pneumoniae - DPM-DC Dose Response
IC50 513.1±n/a nM
Citation PubChem, PC Screening for Inhibitors of the Mevalonate Pathway in Streptococcus Pneumoniae - DPM-DC Dose Response PubChem Bioassay(2007)[AID]
 
Diphosphomevalonate decarboxylase
Name:Diphosphomevalonate decarboxylase
Synonyms:n/a
Type:Enzyme Catalytic Domain
Mol. Mass.:35571.44
Organism:Streptococcus pneumoniae D39
Description:A0A0H2ZN59
Residue:317
BDBM34233
NameBDBM34233
TypeSmall organic molecule
Emp. Form.C13H9NOSe
Mol. Mass.274.18
SMILESO=c1n([se]c2ccccc12)-c1ccccc1