Reaction Details
TargetDual specificity protein phosphatase 6
LigandBDBM35440
Substrate/Competitorn/a
Meas. Tech.In vitro MKP-3 Phosphatase Dose Response Hit/Probe Assessment Assay
IC50>50000±n/a nM
Citation PubChem, PC In vitro MKP-3 Phosphatase Dose Response Hit/Probe Assessment Assay PubChem Bioassay(2007)[AID]
 
Dual specificity protein phosphatase 6
Name:Dual specificity protein phosphatase 6
Type:Enzyme
Mol. Mass.:42303.19
Organism:Rattus norvegicus
Description:gi_16758752
Residue:381
BDBM35440
NameBDBM35440
Synonyms:ALLOPURINOL SMR000059083 | cid_2094
TypeSmall organic molecule
Emp. Form.C5H4N4O
Mol. Mass.136.1115
SMILESO=c1[nH]cnc2n[nH]cc12