Reaction Details
TargetMevalonate kinase
LigandBDBM38524
Substrate/Competitorn/a
Meas. Tech.Screening for Inhibitors of the Mevalonate Pathway in Streptococcus Pneumoniae - MK Dose Response
IC50>9999000±n/a nM
Citation PubChem, PC Screening for Inhibitors of the Mevalonate Pathway in Streptococcus Pneumoniae - MK Dose Response PubChem Bioassay(2007)[AID]
 
Mevalonate kinase
Name:Mevalonate kinase
Synonyms:n/a
Type:Enzyme Catalytic Domain
Mol. Mass.:31420.64
Organism:Streptococcus pneumoniae D39
Description:A0A0H2ZQX9
Residue:292
BDBM38524
NameBDBM38524
TypeSmall organic molecule
Emp. Form.C22H31N5O4S2
Mol. Mass.493.643
SMILESCC(C)NC(=O)CSc1nnc(-c2ccc(cc2)S(=O)(=O)N2CCCC2)n1CC1CCCO1