Reaction Details
TargetMevalonate kinase
LigandBDBM38544
Substrate/Competitorn/a
Meas. Tech.Screening for Inhibitors of the Mevalonate Pathway in Streptococcus Pneumoniae - MK Dose Response
IC50>9999000±n/a nM
Citation PubChem, PC Screening for Inhibitors of the Mevalonate Pathway in Streptococcus Pneumoniae - MK Dose Response PubChem Bioassay(2007)[AID]
 
Mevalonate kinase
Name:Mevalonate kinase
Synonyms:n/a
Type:Enzyme Catalytic Domain
Mol. Mass.:31420.64
Organism:Streptococcus pneumoniae D39
Description:A0A0H2ZQX9
Residue:292
BDBM38544
NameBDBM38544
TypeSmall organic molecule
Emp. Form.C18H28N2O4
Mol. Mass.336.4259
SMILESCOc1cc(CN2CCN(CC2)C(=O)CC(C)C)cc(OC)c1O