Reaction Details
TargetMevalonate kinase
LigandBDBM38555
Substrate/Competitorn/a
Meas. Tech.Screening for Inhibitors of the Mevalonate Pathway in Streptococcus Pneumoniae - MK Dose Response
IC50>9999000±n/a nM
Citation PubChem, PC Screening for Inhibitors of the Mevalonate Pathway in Streptococcus Pneumoniae - MK Dose Response PubChem Bioassay(2007)[AID]
 
Mevalonate kinase
Name:Mevalonate kinase
Synonyms:n/a
Type:Enzyme Catalytic Domain
Mol. Mass.:31420.64
Organism:Streptococcus pneumoniae D39
Description:A0A0H2ZQX9
Residue:292
BDBM38555
NameBDBM38555
TypeSmall organic molecule
Emp. Form.C17H27NO4
Mol. Mass.309.4006
SMILESCOc1cccc(OC)c1OCC(C)CNCC1CCCO1