Reaction Details
TargetMevalonate kinase
LigandBDBM34579
Substrate/Competitorn/a
Meas. Tech.Screening for Inhibitors of the Mevalonate Pathway in Streptococcus Pneumoniae - MK Dose Response
IC50 8716.8±n/a nM
Citation PubChem, PC Screening for Inhibitors of the Mevalonate Pathway in Streptococcus Pneumoniae - MK Dose Response PubChem Bioassay(2007)[AID]
 
Mevalonate kinase
Name:Mevalonate kinase
Synonyms:n/a
Type:Enzyme Catalytic Domain
Mol. Mass.:31420.64
Organism:Streptococcus pneumoniae D39
Description:A0A0H2ZQX9
Residue:292
BDBM34579
NameBDBM34579
TypeSmall organic molecule
Emp. Form.C21H23NO3
Mol. Mass.337.4122
SMILESCN(Cc1c(O)ccc2c3ccccc3c(=O)oc12)C1CCCCC1