Reaction Details
TargetMevalonate kinase
LigandBDBM38361
Substrate/Competitorn/a
Meas. Tech.Screening for Inhibitors of the Mevalonate Pathway in Streptococcus Pneumoniae - MK Dose Response
IC50 14551.6±n/a nM
Citation PubChem, PC Screening for Inhibitors of the Mevalonate Pathway in Streptococcus Pneumoniae - MK Dose Response PubChem Bioassay(2007)[AID]
 
Mevalonate kinase
Name:Mevalonate kinase
Synonyms:n/a
Type:Enzyme Catalytic Domain
Mol. Mass.:31420.64
Organism:Streptococcus pneumoniae D39
Description:A0A0H2ZQX9
Residue:292
BDBM38361
NameBDBM38361
TypeSmall organic molecule
Emp. Form.C17H16N2O3S2
Mol. Mass.360.451
SMILESO=c1n(sc2ccccc12)-c1ccc(cc1)S(=O)(=O)N1CCCC1