Reaction Details
TargetMevalonate kinase
LigandBDBM38612
Substrate/Competitorn/a
Meas. Tech.Screening for Inhibitors of the Mevalonate Pathway in Streptococcus Pneumoniae - MK Dose Response
IC50 4744.9±n/a nM
Citation PubChem, PC Screening for Inhibitors of the Mevalonate Pathway in Streptococcus Pneumoniae - MK Dose Response PubChem Bioassay(2007)[AID]
 
Mevalonate kinase
Name:Mevalonate kinase
Synonyms:n/a
Type:Enzyme Catalytic Domain
Mol. Mass.:31420.64
Organism:Streptococcus pneumoniae D39
Description:A0A0H2ZQX9
Residue:292
BDBM38612
NameBDBM38612
TypeSmall organic molecule
Emp. Form.C22H20ClN3O3
Mol. Mass.409.866
SMILESCOc1ccc(Cn2c(Nc3cc(Cl)ccc3OC)c3[nH]cccc3c2=O)cc1