Reaction Details
TargetDual specificity protein phosphatase 1
LigandBDBM35379
Substrate/Competitorn/a
Meas. Tech.In vitro MKP-1 Phosphatase Dose Response Active/Probe Assessment Assay - Effects of Catalase
IC50 25522±n/a nM
Citation PubChem, PC In vitro MKP-1 Phosphatase Dose Response Active/Probe Assessment Assay - Effects of Catalase PubChem Bioassay(2006)[AID]
 
Dual specificity protein phosphatase 1
Name:Dual specificity protein phosphatase 1
Type:Protein phosphatase
Mol. Mass.:39301.48
Organism:Homo sapiens (Human)
Description:gi_4758204
Residue:367
BDBM35379
NameBDBM35379
Synonyms:2-(2-furanyl)-4-quinolinecarboxylic acid [2-[4-amino-1-methyl-3-(2-methylpropyl)-2,6-dioxo-5-pyrimidinyl]-2-oxoethyl] ester MLS000058168 [2-[4-amino-1-methyl-3-(2-methylpropyl)-2,6-dioxopyrimidin-5-yl]-2-oxoethyl] 2-(furan-2-yl)quinoline-4-carboxylate cid_2094474
TypeSmall organic molecule
Emp. Form.C25H24N4O6
Mol. Mass.476.4813
SMILESCC(C)Cn1c(N)c(C(=O)COC(=O)c2cc(nc3ccccc23)-c2ccco2)c(=O)n(C)c1=O