Reaction Details
TargetDual specificity protein phosphatase 6
LigandBDBM35361
Substrate/Competitorn/a
Meas. Tech.In vitro MKP-3 Phosphatase Dose Response Active/Probe Assessment Assay - Reproducibility testing
IC50>50000±n/a nM
Citation PubChem, PC In vitro MKP-3 Phosphatase Dose Response Active/Probe Assessment Assay - Reproducibility testing PubChem Bioassay(2007)[AID]
 
Dual specificity protein phosphatase 6
Name:Dual specificity protein phosphatase 6
Type:Enzyme
Mol. Mass.:42303.19
Organism:Rattus norvegicus
Description:gi_16758752
Residue:381
BDBM35361
NameBDBM35361
Synonyms:(5-oxidanidyl-4-thiophen-2-ylcarbonyl-1,2,5-oxadiazol-5-ium-3-yl)-thiophen-2-yl-methanone SMR000034137 [5-oxido-4-(thiophene-2-carbonyl)-1,2,5-oxadiazol-5-ium-3-yl]-thiophen-2-ylmethanone cid_573747
TypeSmall organic molecule
Emp. Form.C12H6N2O4S2
Mol. Mass.306.317
SMILES[O-]n1[o+]nc(C(=O)c2cccs2)c1C(=O)c1cccs1