Reaction Details
TargetIsoform 2 of Nuclear receptor ROR-alpha (Alpha-2)
LigandBDBM50090910
Substrate/Competitorn/a
Meas. Tech.Counterscreen for inhibitors of the nuclear receptor Steroidogenic Factor 1 (SF-1): A cell-based dose-response assay for inhibition of the RAR-related orphan receptor A (RORA)
IC50 464±n/a nM
Citation PubChem, PC Counterscreen for inhibitors of the nuclear receptor Steroidogenic Factor 1 (SF-1): A cell-based dose-response assay for inhibition of the RAR-related orphan receptor A (RORA) PubChem Bioassay(2007)[AID]
 
Isoform 2 of Nuclear receptor ROR-alpha (Alpha-2)
Name:Isoform 2 of Nuclear receptor ROR-alpha (Alpha-2)
Type:PROTEIN
Mol. Mass.:63033.59
Organism:Homo sapiens (Human)
Description:EBI_101591
Residue:556
BDBM50090910
NameBDBM50090910
Synonyms:3alpha,16,17,18-tetrahydroxyaphidicolone 6,13-di(hydroxymethyl)-2,6-dimethyl-(1S,2S,5R,6R,7R,10S,12R,13R)-tetracyclo[10.3.1.01,10.02,7]hexadecane-5,13-diol (Aphidicolin) CHEMBL29711 aphidicolin | cid_457964
TypeSmall organic molecule
Emp. Form.C20H34O4
Mol. Mass.338.4816
SMILESC[C@@]1(CO)[C@H](O)CC[C@@]2(C)[C@H]1CC[C@H]1C[C@@H]3C[C@]21CC[C@]3(O)CO