Reaction Details
TargetIsoform 2 of Nuclear receptor ROR-alpha (Alpha-2)
LigandBDBM36897
Substrate/Competitorn/a
Meas. Tech.Counterscreen for inhibitors of the nuclear receptor Steroidogenic Factor 1 (SF-1): A cell-based dose-response assay for inhibition of the RAR-related orphan receptor A (RORA)
IC50 1225±n/a nM
Citation PubChem, PC Counterscreen for inhibitors of the nuclear receptor Steroidogenic Factor 1 (SF-1): A cell-based dose-response assay for inhibition of the RAR-related orphan receptor A (RORA) PubChem Bioassay(2007)[AID]
 
Isoform 2 of Nuclear receptor ROR-alpha (Alpha-2)
Name:Isoform 2 of Nuclear receptor ROR-alpha (Alpha-2)
Type:PROTEIN
Mol. Mass.:63033.59
Organism:Homo sapiens (Human)
Description:EBI_101591
Residue:556
BDBM36897
NameBDBM36897
Synonyms:8-fluoranyl-4-(4-phenylpiperazin-1-yl)-5H-pyrimido[5,4-b]indole 8-fluoro-4-(4-phenylpiperazin-1-yl)-5H-pyrimido[5,4-b]indole MLS000078400 cid_659453
TypeSmall organic molecule
Emp. Form.C20H18FN5
Mol. Mass.347.3888
SMILESFc1ccc2[nH]c3c(ncnc3c2c1)N1CCN(CC1)c1ccccc1