Reaction Details
TargetIsoform 2 of Nuclear receptor ROR-alpha (Alpha-2)
LigandBDBM38923
Substrate/Competitorn/a
Meas. Tech.Counterscreen for inhibitors of the nuclear receptor Steroidogenic Factor 1 (SF-1): A cell-based dose-response assay for inhibition of the RAR-related orphan receptor A (RORA)
IC50 6329±n/a nM
Citation PubChem, PC Counterscreen for inhibitors of the nuclear receptor Steroidogenic Factor 1 (SF-1): A cell-based dose-response assay for inhibition of the RAR-related orphan receptor A (RORA) PubChem Bioassay(2007)[AID]
 
Isoform 2 of Nuclear receptor ROR-alpha (Alpha-2)
Name:Isoform 2 of Nuclear receptor ROR-alpha (Alpha-2)
Type:PROTEIN
Mol. Mass.:63033.59
Organism:Homo sapiens (Human)
Description:EBI_101591
Residue:556
BDBM38923
NameBDBM38923
Synonyms:(2-oxidanylideneoxolan-3-yl) 5-(1,3-benzothiazol-2-yl)thiophene-2-carboxylate 5-(1,3-benzothiazol-2-yl)-2-thiophenecarboxylic acid (2-oxo-3-oxolanyl) ester MLS000096514 cid_2997660
TypeSmall organic molecule
Emp. Form.C16H11NO4S2
Mol. Mass.345.393
SMILESO=C(OC1CCOC1=O)c1ccc(s1)-c1nc2ccccc2s1