Reaction Details
TargetIsoform 2 of Nuclear receptor ROR-alpha (Alpha-2)
LigandBDBM31068
Substrate/Competitorn/a
Meas. Tech.Counterscreen for inhibitors of the nuclear receptor Steroidogenic Factor 1 (SF-1): A cell-based dose-response assay for inhibition of the RAR-related orphan receptor A (RORA)
IC50 6160±n/a nM
Citation PubChem, PC Counterscreen for inhibitors of the nuclear receptor Steroidogenic Factor 1 (SF-1): A cell-based dose-response assay for inhibition of the RAR-related orphan receptor A (RORA) PubChem Bioassay(2007)[AID]
 
Isoform 2 of Nuclear receptor ROR-alpha (Alpha-2)
Name:Isoform 2 of Nuclear receptor ROR-alpha (Alpha-2)
Type:PROTEIN
Mol. Mass.:63033.59
Organism:Homo sapiens (Human)
Description:EBI_101591
Residue:556
BDBM31068
NameBDBM31068
Synonyms:2-(methylsulfonyl)-4-thien-2-yl-6-(trifluoromethyl)pyrimidine 2-methylsulfonyl-4-thiophen-2-yl-6-(trifluoromethyl)pyrimidine SMR000022589 cid_3245258
TypeSmall organic molecule
Emp. Form.C10H7F3N2O2S2
Mol. Mass.308.3
SMILESCS(=O)(=O)c1nc(cc(n1)C(F)(F)F)-c1cccs1